GEN	tests/pixfmts.mak
HOSTCC	tests/base64.o
HOSTCC	tests/tiny_psnr.o
HOSTCC	tests/tiny_ssim.o
HOSTCC	tests/audiomatch.o
CC	tests/checkasm/aacpsdsp.o
CC	tests/checkasm/af_afir.o
CC	tests/checkasm/alacdsp.o
CC	tests/checkasm/audiodsp.o
CC	tests/checkasm/blockdsp.o
CC	tests/checkasm/bswapdsp.o
CC	tests/checkasm/checkasm.o
CC	tests/checkasm/exrdsp.o
CC	tests/checkasm/fixed_dsp.o
CC	tests/checkasm/flacdsp.o
CC	tests/checkasm/float_dsp.o
CC	tests/checkasm/fmtconvert.o
CC	tests/checkasm/g722dsp.o
CC	tests/checkasm/h264dsp.o
CC	tests/checkasm/h264pred.o
CC	tests/checkasm/h264qpel.o
CC	tests/checkasm/hevc_add_res.o
CC	tests/checkasm/hevc_idct.o
CC	tests/checkasm/hevc_sao.o
CC	tests/checkasm/jpeg2000dsp.o
CC	tests/checkasm/huffyuvdsp.o
CC	tests/checkasm/llviddsp.o
CC	tests/checkasm/llviddspenc.o
CC	tests/checkasm/opusdsp.o
CC	tests/checkasm/pixblockdsp.o
CC	tests/checkasm/sbrdsp.o
CC	tests/checkasm/sw_rgb.o
CC	tests/checkasm/synth_filter.o
CC	tests/checkasm/sw_scale.o
CC	tests/checkasm/utvideodsp.o
CC	tests/checkasm/v210dec.o
CC	tests/checkasm/vf_blend.o
CC	tests/checkasm/v210enc.o
CC	tests/checkasm/vf_colorspace.o
CC	tests/checkasm/vf_eq.o
CC	tests/checkasm/vf_gblur.o
CC	tests/checkasm/vf_hflip.o
CC	tests/checkasm/vf_nlmeans.o
CC	tests/checkasm/vf_threshold.o
CC	tests/checkasm/videodsp.o
CC	tests/checkasm/vp8dsp.o
CC	tests/checkasm/vp9dsp.o
X86ASM	tests/checkasm/x86/checkasm.o
CC	tests/api/api-threadmessage-test.o
CC	tests/api/api-flac-test.o
CC	tests/api/api-seek-test.o
HOSTCC	tests/audiogen.o
HOSTCC	tests/videogen.o
CC	tests/api/api-band-test.o
CC	tests/api/api-h264-slice-test.o
CC	tests/api/api-h264-test.o
CC	tests/api/api-codec-param-test.o
CC	tests/dnn/dnn-layer-pad-test.o
CC	tests/dnn/dnn-layer-conv2d-test.o
CC	tests/dnn/dnn-layer-depth2space-test.o
CC	tests/dnn/dnn-layer-mathbinary-test.o
CC	tests/dnn/dnn-layer-maximum-test.o
CC	tests/dnn/dnn-layer-mathunary-test.o
CC	libavcodec/tests/fft.o
CC	libavcodec/tests/fft-fixed.o
CC	libavcodec/tests/fft-fixed32.o
CC	libavcodec/tests/avfft.o
CC	libavcodec/tests/avpacket.o
tests/api/api-flac-test.c: In function ‘run_test’:
tests/api/api-flac-test.c:166:9: warning: ‘avcodec_encode_audio2’ is deprecated [-Wdeprecated-declarations]
         result = avcodec_encode_audio2(enc_ctx, &enc_pkt, in_frame, &got_output);
         ^
In file included from tests/api/api-flac-test.c:30:0:
./libavcodec/avcodec.h:3652:5: note: declared here
 int avcodec_encode_audio2(AVCodecContext *avctx, AVPacket *avpkt,
     ^
tests/api/api-flac-test.c:174:13: warning: ‘avcodec_decode_audio4’ is deprecated [-Wdeprecated-declarations]
             result = avcodec_decode_audio4(dec_ctx, out_frame, &got_output, &enc_pkt);
             ^
In file included from tests/api/api-flac-test.c:30:0:
./libavcodec/avcodec.h:3024:5: note: declared here
 int avcodec_decode_audio4(AVCodecContext *avctx, AVFrame *frame,
     ^
tests/api/api-seek-test.c: In function ‘compute_crc_of_packets’:
tests/api/api-seek-test.c:119:13: warning: ‘avcodec_decode_video2’ is deprecated [-Wdeprecated-declarations]
             result = avcodec_decode_video2(ctx, fr, &got_frame, &pkt);
             ^
In file included from tests/api/api-seek-test.c:28:0:
./libavcodec/avcodec.h:3073:5: note: declared here
 int avcodec_decode_video2(AVCodecContext *avctx, AVFrame *picture,
     ^
CC	libavcodec/tests/cabac.o
CC	libavcodec/tests/celp_math.o
CC	libavcodec/tests/codec_desc.o
CC	libavcodec/tests/golomb.o
tests/api/api-band-test.c: In function ‘video_decode’:
tests/api/api-band-test.c:171:13: warning: ‘avcodec_decode_video2’ is deprecated [-Wdeprecated-declarations]
             result = avcodec_decode_video2(ctx, fr, &got_frame, &pkt);
             ^
In file included from tests/api/api-band-test.c:28:0:
./libavcodec/avcodec.h:3073:5: note: declared here
 int avcodec_decode_video2(AVCodecContext *avctx, AVFrame *picture,
     ^
tests/api/api-codec-param-test.c: In function ‘try_decode_video_frame’:
tests/api/api-codec-param-test.c:58:9: warning: ‘avcodec_decode_video2’ is deprecated [-Wdeprecated-declarations]
         ret = avcodec_decode_video2(codec_ctx, frame, &got_frame, pkt);
         ^
In file included from ./libavformat/avformat.h:312:0,
                 from tests/api/api-codec-param-test.c:24:
./libavcodec/avcodec.h:3073:5: note: declared here
 int avcodec_decode_video2(AVCodecContext *avctx, AVFrame *picture,
     ^
tests/api/api-codec-param-test.c: In function ‘find_video_stream_info’:
tests/api/api-codec-param-test.c:95:9: warning: ‘codec’ is deprecated [-Wdeprecated-declarations]
         codec_ctx = st->codec;
         ^
In file included from tests/api/api-codec-param-test.c:24:0:
./libavformat/avformat.h:880:21: note: declared here
     AVCodecContext *codec;
                     ^
tests/api/api-codec-param-test.c:120:13: warning: ‘codec’ is deprecated [-Wdeprecated-declarations]
             codec_ctx = st->codec;
             ^
In file included from tests/api/api-codec-param-test.c:24:0:
./libavformat/avformat.h:880:21: note: declared here
     AVCodecContext *codec;
                     ^
tests/api/api-codec-param-test.c:135:9: warning: ‘codec’ is deprecated [-Wdeprecated-declarations]
         avcodec_close(st->codec);
         ^
In file included from tests/api/api-codec-param-test.c:24:0:
./libavformat/avformat.h:880:21: note: declared here
     AVCodecContext *codec;
                     ^
tests/api/api-codec-param-test.c: In function ‘dump_video_streams’:
tests/api/api-codec-param-test.c:148:9: warning: ‘codec’ is deprecated [-Wdeprecated-declarations]
         AVCodecContext *codec_ctx = st->codec;
         ^
In file included from tests/api/api-codec-param-test.c:24:0:
./libavformat/avformat.h:880:21: note: declared here
     AVCodecContext *codec;
                     ^
tests/api/api-codec-param-test.c: In function ‘check_video_streams’:
tests/api/api-codec-param-test.c:199:9: warning: ‘codec’ is deprecated [-Wdeprecated-declarations]
         AVCodecContext *codec_ctx1 = st1->codec;
         ^
In file included from tests/api/api-codec-param-test.c:24:0:
./libavformat/avformat.h:880:21: note: declared here
     AVCodecContext *codec;
                     ^
tests/api/api-codec-param-test.c:200:9: warning: ‘codec’ is deprecated [-Wdeprecated-declarations]
         AVCodecContext *codec_ctx2 = st2->codec;
         ^
In file included from tests/api/api-codec-param-test.c:24:0:
./libavformat/avformat.h:880:21: note: declared here
     AVCodecContext *codec;
                     ^
tests/api/api-h264-test.c: In function ‘video_decode_example’:
tests/api/api-h264-test.c:122:13: warning: ‘avcodec_decode_video2’ is deprecated [-Wdeprecated-declarations]
             result = avcodec_decode_video2(ctx, fr, &got_frame, &pkt);
             ^
In file included from tests/api/api-h264-test.c:28:0:
./libavcodec/avcodec.h:3073:5: note: declared here
 int avcodec_decode_video2(AVCodecContext *avctx, AVFrame *picture,
     ^
CC	libavcodec/tests/dct.o
CC	libavcodec/dctref.o
CC	libavcodec/tests/h264_levels.o
CC	libavcodec/tests/h265_levels.o
CC	libavcodec/tests/iirfilter.o
CC	libavcodec/tests/mpeg12framerate.o
CC	libavcodec/tests/options.o
CC	libavcodec/tests/rangecoder.o
CC	libavcodec/tests/mathops.o
CC	libavcodec/tests/jpeg2000dwt.o
CC	libavcodec/tests/utils.o
CC	libavcodec/tests/mjpegenc_huffman.o
CC	libavformat/tests/noproxy.o
CC	libavcodec/tests/htmlsubtitles.o
CC	libavformat/tests/srtp.o
STRIP	tests/checkasm/x86/checkasm.o
skipping strip -x tests/checkasm/x86/checkasm.o
CC	libavformat/tests/url.o
CC	libavformat/tests/movenc.o
CC	libavutil/tests/adler32.o
CC	libavutil/tests/aes.o
CC	libavutil/tests/aes_ctr.o
CC	libavutil/tests/camellia.o
CC	libavutil/tests/cast5.o
CC	libavutil/tests/audio_fifo.o
CC	libavutil/tests/avstring.o
CC	libavutil/tests/base64.o
CC	libavutil/tests/blowfish.o
libavcodec/tests/options.c: In function ‘test_copy’:
libavcodec/tests/options.c:152:5: warning: ‘avcodec_copy_context’ is deprecated [-Wdeprecated-declarations]
     avcodec_copy_context(ctx2, ctx1);
     ^
In file included from libavcodec/tests/options.c:22:0:
./libavcodec/options.c:231:5: note: declared here
 int avcodec_copy_context(AVCodecContext *dest, const AVCodecContext *src)
     ^
libavcodec/tests/options.c:167:9: warning: ‘avcodec_copy_context’ is deprecated [-Wdeprecated-declarations]
         avcodec_copy_context(ctx2, ctx1);
         ^
In file included from libavcodec/tests/options.c:22:0:
./libavcodec/options.c:231:5: note: declared here
 int avcodec_copy_context(AVCodecContext *dest, const AVCodecContext *src)
     ^
libavcodec/tests/options.c: In function ‘main’:
libavcodec/tests/options.c:187:9: warning: ‘avcodec_register’ is deprecated [-Wdeprecated-declarations]
         avcodec_register(dummy_codec[i]);
         ^
In file included from ./libavcodec/options.c:27:0,
                 from libavcodec/tests/options.c:22:
./libavcodec/avcodec.h:2738:6: note: declared here
 void avcodec_register(AVCodec *codec);
      ^
CC	libavutil/tests/bprint.o
CC	libavutil/tests/cpu.o
CC	libavutil/tests/crc.o
CC	libavutil/tests/color_utils.o
CC	libavutil/tests/des.o
CC	libavutil/tests/dict.o
CC	libavutil/tests/encryption_info.o
CC	libavutil/tests/eval.o
CC	libavutil/tests/fifo.o
CC	libavutil/tests/hash.o
CC	libavutil/tests/imgutils.o
CC	libavutil/tests/hmac.o
CC	libavutil/tests/integer.o
CC	libavutil/tests/lfg.o
CC	libavutil/tests/md5.o
CC	libavutil/tests/murmur3.o
CC	libavutil/tests/parseutils.o
CC	libavutil/tests/pixfmt_best.o
CC	libavutil/tests/display.o
CC	libavutil/tests/random_seed.o
CC	libavutil/tests/ripemd.o
CC	libavutil/tests/sha.o
CC	libavutil/tests/sha512.o
libavutil/tests/md5.c: In function ‘main’:
libavutil/tests/md5.c:41:24: warning: passing argument 2 of ‘av_md5_sum’ discards ‘volatile’ qualifier from pointer target type [-Wdiscarded-qualifiers]
     av_md5_sum(md5val, in, 1000);
                        ^
In file included from libavutil/tests/md5.c:22:0:
./libavutil/md5.h:89:6: note: expected ‘const uint8_t * {aka const unsigned char *}’ but argument is of type ‘volatile uint8_t * {aka volatile unsigned char *}’
 void av_md5_sum(uint8_t *dst, const uint8_t *src, const int len);
      ^
libavutil/tests/md5.c:43:24: warning: passing argument 2 of ‘av_md5_sum’ discards ‘volatile’ qualifier from pointer target type [-Wdiscarded-qualifiers]
     av_md5_sum(md5val, in, 63);
                        ^
In file included from libavutil/tests/md5.c:22:0:
./libavutil/md5.h:89:6: note: expected ‘const uint8_t * {aka const unsigned char *}’ but argument is of type ‘volatile uint8_t * {aka volatile unsigned char *}’
 void av_md5_sum(uint8_t *dst, const uint8_t *src, const int len);
      ^
libavutil/tests/md5.c:45:24: warning: passing argument 2 of ‘av_md5_sum’ discards ‘volatile’ qualifier from pointer target type [-Wdiscarded-qualifiers]
     av_md5_sum(md5val, in, 64);
                        ^
In file included from libavutil/tests/md5.c:22:0:
./libavutil/md5.h:89:6: note: expected ‘const uint8_t * {aka const unsigned char *}’ but argument is of type ‘volatile uint8_t * {aka volatile unsigned char *}’
 void av_md5_sum(uint8_t *dst, const uint8_t *src, const int len);
      ^
libavutil/tests/md5.c:47:24: warning: passing argument 2 of ‘av_md5_sum’ discards ‘volatile’ qualifier from pointer target type [-Wdiscarded-qualifiers]
     av_md5_sum(md5val, in, 65);
                        ^
In file included from libavutil/tests/md5.c:22:0:
./libavutil/md5.h:89:6: note: expected ‘const uint8_t * {aka const unsigned char *}’ but argument is of type ‘volatile uint8_t * {aka volatile unsigned char *}’
 void av_md5_sum(uint8_t *dst, const uint8_t *src, const int len);
      ^
libavutil/tests/md5.c:51:24: warning: passing argument 2 of ‘av_md5_sum’ discards ‘volatile’ qualifier from pointer target type [-Wdiscarded-qualifiers]
     av_md5_sum(md5val, in, 999);
                        ^
In file included from libavutil/tests/md5.c:22:0:
./libavutil/md5.h:89:6: note: expected ‘const uint8_t * {aka const unsigned char *}’ but argument is of type ‘volatile uint8_t * {aka volatile unsigned char *}’
 void av_md5_sum(uint8_t *dst, const uint8_t *src, const int len);
      ^
CC	libavutil/tests/tree.o
CC	libavutil/tests/twofish.o
CC	libavutil/tests/xtea.o
CC	libavutil/tests/tea.o
CC	libavutil/tests/opt.o
CC	libavutil/tests/cpu_init.o
CC	libavutil/tests/pixelutils.o
CC	libswscale/tests/pixdesc_query.o
CC	libavformat/tests/fifo_muxer.o
COPY	tests/data/filtergraphs/anequalizer
COPY	tests/data/filtergraphs/firequalizer
COPY	tests/data/filtergraphs/compand
GEN	tests/data/hls-list.m3u8
GEN	tests/data/hls-list-append.m3u8
COPY	tests/data/filtergraphs/channelmap_one_int
COPY	tests/data/filtergraphs/channelmap_one_str
CC	libavfilter/tests/formats.o
GEN	tests/data/add_keyframe_index.flv
COPY	tests/data/filtergraphs/scalenorm
COPY	tests/data/filtergraphs/concat
COPY	tests/data/filtergraphs/concat-vfr
HOSTCC	tests/rotozoom.o
CC	libavformat/tests/seek.o
COPY	tests/data/filtergraphs/mergeplanes
COPY	tests/data/filtergraphs/hstack
COPY	tests/data/filtergraphs/vstack
COPY	tests/data/filtergraphs/overlay
COPY	tests/data/filtergraphs/overlay_rgb
COPY	tests/data/filtergraphs/overlay_yuv420p10
COPY	tests/data/filtergraphs/overlay_yuv420
COPY	tests/data/filtergraphs/overlay_nv12
COPY	tests/data/filtergraphs/overlay_nv21
COPY	tests/data/filtergraphs/overlay_yuv422
COPY	tests/data/filtergraphs/overlay_yuv422p10
COPY	tests/data/filtergraphs/select-alternate
COPY	tests/data/filtergraphs/overlay_yuv444
COPY	tests/data/filtergraphs/setpts
COPY	tests/data/filtergraphs/alphamerge_alphaextract_rgb
COPY	tests/data/filtergraphs/alphamerge_alphaextract_yuv
COPY	tests/data/filtergraphs/scale2ref_keep_aspect
CC	libavfilter/tests/filtfmts.o
COPY	tests/test_copy.ffmeta
CC	tools/venc_data_dump.o
GEN	tests/data/hevc-mp4.mov
GEN	tests/data/fits-multi.fits
COPY	tests/data/filtergraphs/hqdn3d
COPY	tests/data/filtergraphs/overlay-dvdsub-2397
COPY	tests/data/filtergraphs/gradfun
GEN	tests/data/file4560-override2rotate0.mov
GEN	tests/data/lena-gray.fits
GEN	tests/data/lena-gbrp.fits
GEN	tests/data/lena-gbrp16.fits
GEN	tests/data/lena-gbrap16le.fits
GEN	tests/data/live_no_endlist.m3u8
GEN	tests/data/live_last_endlist.m3u8
GEN	tests/data/live_endlist.m3u8
GEN	tests/data/hls_segment_size.m3u8
GEN	tests/data/hls_segment_single.m3u8
GEN	tests/data/hls_init_time.m3u8
GEN	tests/data/hls_list_size.m3u8
GEN	tests/data/hls_segment_type_fmp4.m3u8
GEN	tests/data/hls_fmp4_ac3.m3u8
GEN	tests/data/mp4-to-ts.m3u8
GEN	tests/data/adts-to-mkv.m3u8
COPY	tests/data/filtergraphs/colorkey
GEN	tests/data/adts-to-mkv-header.mkv
GEN	tests/data/hapq_nosnappy.mov
GEN	tests/data/hapalphaonly_nosnappy.mov
CC	tools/qt-faststart.o
HOSTLD	tests/base64
HOSTLD	tests/tiny_psnr
HOSTLD	tests/tiny_ssim
HOSTLD	tests/audiomatch
LD	tests/api/api-threadmessage-test
LD	tests/api/api-flac-test
LD	tests/api/api-seek-test
HOSTLD	tests/audiogen
HOSTLD	tests/videogen
LD	tests/api/api-band-test
LD	tests/api/api-h264-test
LD	tests/api/api-h264-slice-test
LD	tests/api/api-codec-param-test
LD	tests/dnn/dnn-layer-pad-test
LD	tests/dnn/dnn-layer-conv2d-test
LD	tests/dnn/dnn-layer-depth2space-test
LD	tests/dnn/dnn-layer-mathbinary-test
LD	tests/dnn/dnn-layer-maximum-test
LD	tests/dnn/dnn-layer-mathunary-test
LD	libavcodec/tests/fft
LD	libavcodec/tests/fft-fixed
LD	libavcodec/tests/fft-fixed32
LD	libavcodec/tests/avfft
LD	libavcodec/tests/cabac
LD	libavcodec/tests/avpacket
LD	libavcodec/tests/celp_math
LD	libavcodec/tests/codec_desc
LD	libavcodec/tests/golomb
LD	libavcodec/tests/h264_levels
LD	libavcodec/tests/h265_levels
LD	libavcodec/tests/iirfilter
LD	libavcodec/tests/mpeg12framerate
LD	libavcodec/tests/options
LD	libavcodec/tests/rangecoder
LD	libavcodec/tests/mathops
LD	libavcodec/tests/utils
LD	libavcodec/tests/mjpegenc_huffman
LD	libavcodec/tests/htmlsubtitles
LD	libavformat/tests/noproxy
LD	libavformat/tests/srtp
LD	libavformat/tests/url
LD	libavformat/tests/movenc
LD	libavutil/tests/adler32
LD	libavutil/tests/aes
LD	libavutil/tests/aes_ctr
LD	libavutil/tests/camellia
LD	libavutil/tests/cast5
LD	libavutil/tests/audio_fifo
LD	libavutil/tests/avstring
LD	libavutil/tests/base64
LD	libavutil/tests/blowfish
LD	libavutil/tests/bprint
LD	libavutil/tests/cpu
LD	libavutil/tests/crc
LD	libavutil/tests/dict
LD	libavutil/tests/color_utils
LD	libavutil/tests/encryption_info
LD	libavutil/tests/eval
LD	libavutil/tests/fifo
LD	libavutil/tests/hash
LD	libavutil/tests/hmac
LD	libavutil/tests/integer
LD	libavutil/tests/lfg
LD	libavutil/tests/murmur3
LD	libavutil/tests/display
LD	libavutil/tests/md5
LD	libavutil/tests/random_seed
LD	libavutil/tests/ripemd
LD	libavutil/tests/sha
LD	libavutil/tests/tree
LD	libavutil/tests/sha512
LD	libavutil/tests/twofish
LD	libavutil/tests/xtea
LD	libavutil/tests/tea
LD	libavutil/tests/opt
LD	libavutil/tests/cpu_init
LD	libavutil/tests/pixelutils
LD	libswscale/tests/pixdesc_query
GEN	tests/data/asynth-22050-6.wav
GEN	tests/data/asynth-22050-1.wav
GEN	tests/data/asynth-44100-2.wav
GEN	tests/data/asynth-44100-3.wav
LD	libavformat/tests/fifo_muxer
GEN	tests/data/asynth-44100-1.wav
TEST    filter-chorus
GEN	tests/data/asynth-44100-4.wav
GEN	tests/data/asynth-44100-11.wav
TEST    filter-hls
GEN	tests/data/asynth-44100-6.wav
TEST    flv-add_keyframe_index
TEST    filter-lavd-life
TEST    filter-lavd-testsrc
TEST    filter-testsrc2-yuv420p
TEST    filter-testsrc2-yuv444p
TEST    filter-testsrc2-rgb24
TEST    filter-testsrc2-rgba
TEST    filter-allrgb
TEST    filter-allyuv
TEST    filter-pal75bars
TEST    filter-pal100bars
TEST    filter-rgbtestsrc
TEST    filter-smptebars
TEST    filter-yuvtestsrc-yuv444p
TEST    filter-smptehdbars
TEST    filter-yuvtestsrc-yuv444p12
TEST    filter-lavd-scalenorm
TEST    filter-framerate-up
TEST    filter-framerate-down
TEST    filter-framerate-12bit-up
TEST    filter-framerate-12bit-down
TEST    filter-minterpolate-up
TEST    filter-minterpolate-down
TEST    filter-concat-vfr
TEST    filter-untile
TEST    filter-concat
TEST    filter-mpdecimate
TEST    filter-fps-up
TEST    filter-fps-up-round-down
TEST    filter-fps-up-round-up
TEST    filter-fps-down
TEST    filter-fps-down-round-down
TEST    filter-fps-down-round-up
TEST    filter-fps-down-eof-pass
TEST    filter-fps-start-drop
TEST    filter-fps-start-fill
GEN	tests/data/asynth-2626-1.wav
GEN	tests/data/asynth-8000-1.wav
TEST    swr-resample-s16p-44100-2626
TEST    swr-resample-s16p-44100-8000
TEST    swr-resample-s16p-44100-48000
TEST    swr-resample-s16p-44100-96000
GEN	tests/data/asynth-48000-1.wav
GEN	tests/data/asynth-96000-1.wav
TEST    swr-resample-s32p-2626-8000
TEST    swr-resample-s32p-2626-48000
TEST    swr-resample-s32p-8000-2626
TEST    swr-resample-s32p-8000-44100
TEST    swr-resample-s32p-2626-96000
TEST    swr-resample-s32p-2626-44100
TEST    swr-resample-s32p-8000-48000
TEST    swr-resample-s32p-8000-96000
TEST    swr-resample-s32p-44100-2626
TEST    swr-resample-s32p-44100-8000
TEST    swr-resample-s32p-44100-48000
TEST    swr-resample-s32p-44100-96000
TEST    swr-resample-s32p-48000-2626
TEST    swr-resample-s32p-48000-8000
TEST    swr-resample-s32p-48000-44100
TEST    swr-resample-s32p-48000-96000
TEST    swr-resample-s32p-96000-2626
TEST    swr-resample-s32p-96000-8000
TEST    swr-resample-s32p-96000-44100
TEST    swr-resample-s32p-96000-48000
TEST    swr-resample-fltp-2626-8000
TEST    swr-resample-fltp-2626-44100
TEST    swr-resample-fltp-2626-48000
TEST    swr-resample-fltp-2626-96000
TEST    swr-resample-fltp-8000-2626
TEST    swr-resample-fltp-8000-44100
TEST    swr-resample-fltp-8000-48000
TEST    swr-resample-fltp-8000-96000
TEST    swr-resample-fltp-44100-2626
TEST    swr-resample-fltp-44100-8000
TEST    swr-resample-fltp-44100-48000
TEST    swr-resample-fltp-44100-96000
TEST    swr-resample-fltp-48000-2626
TEST    swr-resample-fltp-48000-8000
TEST    swr-resample-fltp-48000-44100
TEST    swr-resample-fltp-48000-96000
TEST    swr-resample-fltp-96000-2626
TEST    swr-resample-fltp-96000-8000
TEST    swr-resample-fltp-96000-44100
TEST    swr-resample-fltp-96000-48000
TEST    swr-resample-dblp-2626-8000
TEST    swr-resample-dblp-2626-44100
TEST    swr-resample-dblp-2626-48000
TEST    swr-resample-dblp-2626-96000
TEST    swr-resample-dblp-8000-2626
TEST    swr-resample-dblp-8000-44100
TEST    swr-resample-dblp-8000-48000
TEST    swr-resample-dblp-8000-96000
TEST    swr-resample-dblp-44100-2626
TEST    swr-resample-dblp-44100-8000
TEST    swr-resample-dblp-44100-48000
TEST    swr-resample-dblp-44100-96000
TEST    swr-resample-dblp-48000-2626
TEST    swr-resample-dblp-48000-8000
TEST    swr-resample-dblp-48000-44100
TEST    swr-resample-dblp-48000-96000
TEST    swr-resample-dblp-96000-2626
TEST    swr-resample-dblp-96000-8000
TEST    swr-resample-dblp-96000-44100
TEST    swr-resample-dblp-96000-48000
TEST    swr-resample_lin-s16p-8000-44100
TEST    swr-resample_lin-s16p-8000-48000
TEST    swr-resample_lin-s16p-44100-8000
TEST    swr-resample_lin-s16p-44100-48000
TEST    swr-resample_lin-s16p-48000-8000
TEST    swr-resample_lin-s16p-48000-44100
TEST    swr-resample_lin-fltp-8000-44100
TEST    swr-resample_lin-fltp-8000-48000
TEST    swr-resample_lin-fltp-44100-8000
TEST    swr-resample_lin-fltp-44100-48000
TEST    swr-resample_lin-fltp-48000-8000
TEST    swr-resample_lin-dblp-8000-44100
TEST    swr-resample_lin-fltp-48000-44100
TEST    swr-resample_lin-dblp-8000-48000
TEST    swr-resample_lin-dblp-44100-8000
TEST    swr-resample_lin-dblp-44100-48000
TEST    swr-resample_lin-dblp-48000-8000
TEST    swr-resample_lin-dblp-48000-44100
TEST    swr-resample_nn-s16p-8000-44100
TEST    swr-resample_nn-s16p-44100-8000
TEST    swr-resample_nn-fltp-8000-44100
TEST    swr-resample_nn-fltp-44100-8000
TEST    swr-resample_async-s16p-8000-44100
TEST    swr-resample_async-s16p-44100-8000
TEST    swr-resample_async-fltp-8000-44100
TEST    swr-resample_async-fltp-44100-8000
TEST    swr-resample_exact-s16p-2626-8000
TEST    swr-resample_exact-s16p-2626-44100
TEST    swr-resample_exact-s16p-2626-48000
TEST    swr-resample_exact-s16p-2626-96000
TEST    swr-resample_exact-s16p-8000-44100
TEST    swr-resample_exact-s16p-8000-2626
TEST    swr-resample_exact-s16p-8000-48000
TEST    swr-resample_exact-s16p-8000-96000
TEST    swr-resample_exact-s16p-44100-2626
TEST    swr-resample_exact-s16p-44100-8000
TEST    swr-resample_exact-s16p-44100-48000
TEST    swr-resample_exact-s16p-44100-96000
TEST    swr-resample_exact-s16p-48000-2626
TEST    swr-resample_exact-s16p-48000-44100
TEST    swr-resample_exact-s16p-48000-8000
TEST    swr-resample_exact-s16p-48000-96000
TEST    swr-resample_exact-s16p-96000-2626
TEST    swr-resample_exact-s16p-96000-8000
TEST    swr-resample_exact-s16p-96000-44100
TEST    swr-resample_exact-s16p-96000-48000
TEST    swr-resample_exact-s32p-2626-8000
TEST    swr-resample_exact-s32p-2626-44100
TEST    swr-resample_exact-s32p-2626-48000
TEST    swr-resample_exact-s32p-2626-96000
TEST    swr-resample_exact-s32p-8000-2626
TEST    swr-resample_exact-s32p-8000-44100
TEST    swr-resample_exact-s32p-8000-48000
TEST    swr-resample_exact-s32p-8000-96000
TEST    swr-resample_exact-s32p-44100-2626
TEST    swr-resample_exact-s32p-44100-8000
TEST    swr-resample_exact-s32p-44100-48000
TEST    swr-resample_exact-s32p-44100-96000
TEST    swr-resample_exact-s32p-48000-2626
TEST    swr-resample_exact-s32p-48000-8000
TEST    swr-resample_exact-s32p-48000-44100
TEST    swr-resample_exact-s32p-48000-96000
TEST    swr-resample_exact-s32p-96000-2626
TEST    swr-resample_exact-s32p-96000-8000
TEST    swr-resample_exact-s32p-96000-44100
TEST    swr-resample_exact-s32p-96000-48000
TEST    swr-resample_exact-fltp-2626-8000
TEST    swr-resample_exact-fltp-2626-44100
TEST    swr-resample_exact-fltp-2626-48000
TEST    swr-resample_exact-fltp-2626-96000
TEST    swr-resample_exact-fltp-8000-2626
TEST    swr-resample_exact-fltp-8000-44100
TEST    swr-resample_exact-fltp-8000-48000
TEST    swr-resample_exact-fltp-8000-96000
TEST    swr-resample_exact-fltp-44100-2626
TEST    swr-resample_exact-fltp-44100-8000
TEST    swr-resample_exact-fltp-44100-48000
TEST    swr-resample_exact-fltp-44100-96000
TEST    swr-resample_exact-fltp-48000-2626
TEST    swr-resample_exact-fltp-48000-8000
TEST    swr-resample_exact-fltp-48000-44100
TEST    swr-resample_exact-fltp-48000-96000
TEST    swr-resample_exact-fltp-96000-2626
TEST    swr-resample_exact-fltp-96000-8000
TEST    swr-resample_exact-dblp-2626-8000
TEST    swr-resample_exact-fltp-96000-48000
TEST    swr-resample_exact-fltp-96000-44100
TEST    swr-resample_exact-dblp-2626-44100
TEST    swr-resample_exact-dblp-2626-48000
TEST    swr-resample_exact-dblp-2626-96000
TEST    swr-resample_exact-dblp-8000-2626
TEST    swr-resample_exact-dblp-8000-44100
TEST    swr-resample_exact-dblp-8000-48000
TEST    swr-resample_exact-dblp-8000-96000
TEST    swr-resample_exact-dblp-44100-2626
TEST    swr-resample_exact-dblp-44100-8000
TEST    swr-resample_exact-dblp-44100-48000
TEST    swr-resample_exact-dblp-44100-96000
TEST    swr-resample_exact-dblp-48000-2626
TEST    swr-resample_exact-dblp-48000-8000
TEST    swr-resample_exact-dblp-48000-44100
TEST    swr-resample_exact-dblp-48000-96000
TEST    swr-resample_exact-dblp-96000-2626
TEST    swr-resample_exact-dblp-96000-8000
TEST    swr-resample_exact-dblp-96000-44100
TEST    swr-resample_exact-dblp-96000-48000
TEST    swr-resample_exact_async-s16p-8000-44100
TEST    swr-resample_exact_async-s16p-8000-48000
TEST    swr-resample_exact_async-s16p-44100-8000
TEST    swr-resample_exact_async-s16p-44100-48000
TEST    swr-resample_exact_async-s16p-48000-8000
TEST    swr-resample_exact_async-s16p-48000-44100
TEST    swr-resample_exact_async-s32p-8000-44100
TEST    swr-resample_exact_async-s32p-8000-48000
TEST    swr-resample_exact_async-s32p-44100-8000
TEST    swr-resample_exact_async-s32p-44100-48000
TEST    swr-resample_exact_async-s32p-48000-8000
TEST    swr-resample_exact_async-s32p-48000-44100
TEST    swr-resample_exact_async-fltp-8000-44100
TEST    swr-resample_exact_async-fltp-8000-48000
TEST    swr-resample_exact_async-fltp-44100-8000
TEST    swr-resample_exact_async-fltp-44100-48000
TEST    swr-resample_exact_async-fltp-48000-8000
TEST    swr-resample_exact_async-fltp-48000-44100
TEST    swr-resample_exact_async-dblp-8000-44100
TEST    swr-resample_exact_async-dblp-8000-48000
TEST    swr-resample_exact_async-dblp-44100-8000
TEST    swr-resample_exact_async-dblp-44100-48000
TEST    swr-resample_exact_async-dblp-48000-8000
TEST    swr-resample_exact_async-dblp-48000-44100
TEST    swr-resample_exact_lin-s16p-2626-8000
TEST    swr-resample_exact_lin-s16p-2626-44100
TEST    swr-resample_exact_lin-s16p-2626-48000
TEST    swr-resample_exact_lin-s16p-2626-96000
TEST    swr-resample_exact_lin-s16p-8000-2626
TEST    swr-resample_exact_lin-s16p-8000-44100
TEST    swr-resample_exact_lin-s16p-8000-48000
TEST    swr-resample_exact_lin-s16p-8000-96000
TEST    swr-resample_exact_lin-s16p-44100-2626
TEST    swr-resample_exact_lin-s16p-44100-8000
TEST    swr-resample_exact_lin-s16p-44100-48000
TEST    swr-resample_exact_lin-s16p-48000-2626
TEST    swr-resample_exact_lin-s16p-44100-96000
TEST    swr-resample_exact_lin-s16p-48000-8000
TEST    swr-resample_exact_lin-s16p-48000-44100
TEST    swr-resample_exact_lin-s16p-48000-96000
TEST    swr-resample_exact_lin-s16p-96000-2626
TEST    swr-resample_exact_lin-s16p-96000-8000
TEST    swr-resample_exact_lin-s16p-96000-44100
TEST    swr-resample_exact_lin-s16p-96000-48000
TEST    swr-resample_exact_lin-s32p-2626-8000
TEST    swr-resample_exact_lin-s32p-2626-44100
TEST    swr-resample_exact_lin-s32p-2626-48000
TEST    swr-resample_exact_lin-s32p-2626-96000
TEST    swr-resample_exact_lin-s32p-8000-2626
TEST    swr-resample_exact_lin-s32p-8000-44100
TEST    swr-resample_exact_lin-s32p-8000-48000
TEST    swr-resample_exact_lin-s32p-8000-96000
TEST    swr-resample_exact_lin-s32p-44100-8000
TEST    swr-resample_exact_lin-s32p-44100-2626
TEST    swr-resample_exact_lin-s32p-44100-48000
TEST    swr-resample_exact_lin-s32p-44100-96000
TEST    swr-resample_exact_lin-s32p-48000-2626
TEST    swr-resample_exact_lin-s32p-48000-8000
TEST    swr-resample_exact_lin-s32p-48000-44100
TEST    swr-resample_exact_lin-s32p-48000-96000
TEST    swr-resample_exact_lin-s32p-96000-2626
TEST    swr-resample_exact_lin-s32p-96000-8000
TEST    swr-resample_exact_lin-s32p-96000-44100
TEST    swr-resample_exact_lin-s32p-96000-48000
TEST    swr-resample_exact_lin-fltp-2626-8000
TEST    swr-resample_exact_lin-fltp-2626-44100
TEST    swr-resample_exact_lin-fltp-2626-48000
TEST    swr-resample_exact_lin-fltp-2626-96000
TEST    swr-resample_exact_lin-fltp-8000-2626
TEST    swr-resample_exact_lin-fltp-8000-44100
TEST    swr-resample_exact_lin-fltp-8000-48000
TEST    swr-resample_exact_lin-fltp-8000-96000
TEST    swr-resample_exact_lin-fltp-44100-2626
TEST    swr-resample_exact_lin-fltp-44100-8000
TEST    swr-resample_exact_lin-fltp-44100-48000
TEST    swr-resample_exact_lin-fltp-44100-96000
TEST    swr-resample_exact_lin-fltp-48000-2626
TEST    swr-resample_exact_lin-fltp-48000-8000
TEST    swr-resample_exact_lin-fltp-48000-44100
TEST    swr-resample_exact_lin-fltp-48000-96000
TEST    swr-resample_exact_lin-fltp-96000-2626
TEST    swr-resample_exact_lin-fltp-96000-44100
TEST    swr-resample_exact_lin-fltp-96000-8000
TEST    swr-resample_exact_lin-fltp-96000-48000
TEST    swr-resample_exact_lin-dblp-2626-8000
TEST    swr-resample_exact_lin-dblp-2626-44100
TEST    swr-resample_exact_lin-dblp-2626-48000
TEST    swr-resample_exact_lin-dblp-2626-96000
TEST    swr-resample_exact_lin-dblp-8000-2626
TEST    swr-resample_exact_lin-dblp-8000-44100
TEST    swr-resample_exact_lin-dblp-8000-48000
TEST    swr-resample_exact_lin-dblp-8000-96000
TEST    swr-resample_exact_lin-dblp-44100-2626
TEST    swr-resample_exact_lin-dblp-44100-8000
TEST    swr-resample_exact_lin-dblp-44100-48000
TEST    swr-resample_exact_lin-dblp-44100-96000
TEST    swr-resample_exact_lin-dblp-48000-2626
TEST    swr-resample_exact_lin-dblp-48000-8000
TEST    swr-resample_exact_lin-dblp-48000-44100
TEST    swr-resample_exact_lin-dblp-48000-96000
TEST    swr-resample_exact_lin-dblp-96000-2626
TEST    swr-resample_exact_lin-dblp-96000-8000
TEST    swr-resample_exact_lin-dblp-96000-44100
TEST    swr-resample_exact_lin-dblp-96000-48000
TEST    swr-resample_exact_lin_async-s16p-8000-44100
TEST    swr-resample_exact_lin_async-s16p-8000-48000
TEST    swr-resample_exact_lin_async-s16p-44100-8000
TEST    swr-resample_exact_lin_async-s16p-48000-8000
TEST    swr-resample_exact_lin_async-s16p-44100-48000
TEST    swr-resample_exact_lin_async-s16p-48000-44100
TEST    swr-resample_exact_lin_async-s32p-8000-44100
TEST    swr-resample_exact_lin_async-s32p-8000-48000
TEST    swr-resample_exact_lin_async-s32p-44100-8000
TEST    swr-resample_exact_lin_async-s32p-44100-48000
TEST    swr-resample_exact_lin_async-s32p-48000-8000
TEST    swr-resample_exact_lin_async-s32p-48000-44100
TEST    swr-resample_exact_lin_async-fltp-8000-44100
TEST    swr-resample_exact_lin_async-fltp-8000-48000
TEST    swr-resample_exact_lin_async-fltp-44100-8000
TEST    swr-resample_exact_lin_async-fltp-44100-48000
TEST    swr-resample_exact_lin_async-fltp-48000-8000
TEST    swr-resample_exact_lin_async-fltp-48000-44100
TEST    swr-resample_exact_lin_async-dblp-8000-44100
TEST    swr-resample_exact_lin_async-dblp-8000-48000
TEST    swr-resample_exact_lin_async-dblp-44100-8000
TEST    swr-resample_exact_lin_async-dblp-44100-48000
TEST    swr-resample_exact_lin_async-dblp-48000-8000
TEST    swr-resample_exact_lin_async-dblp-48000-44100
TEST    swr-audioconvert
GEN	tests/data/asynth-96000-6.wav
TEST    ffmpeg-filter_complex
TEST    ffmpeg-filter_complex_audio
TEST    ffmpeg-lavfi
TEST    acodec-pcm-alaw
TEST    acodec-pcm-mulaw
TEST    acodec-pcm-s8
TEST    acodec-pcm-u8
TEST    acodec-pcm-s16be
TEST    acodec-pcm-s16le
TEST    acodec-pcm-u16le
TEST    acodec-pcm-u16be
TEST    acodec-pcm-s24be
TEST    acodec-pcm-s24le
TEST    acodec-pcm-u24be
TEST    acodec-pcm-u24le
TEST    acodec-pcm-s32be
TEST    acodec-pcm-s32le
TEST    acodec-pcm-u32be
TEST    acodec-pcm-u32le
TEST    acodec-pcm-f32be
TEST    acodec-pcm-f32le
TEST    acodec-pcm-f64be
TEST    acodec-pcm-f64le
TEST    acodec-pcm-s8_planar
TEST    acodec-pcm-s16be_planar
TEST    acodec-pcm-s16le_planar
TEST    acodec-pcm-s24le_planar
TEST    acodec-pcm-s32le_planar
TEST    acodec-adpcm-adx
TEST    acodec-adpcm-ima_qt
TEST    acodec-adpcm-ima_ssi
TEST    acodec-adpcm-ima_wav
TEST    acodec-adpcm-ms
TEST    acodec-adpcm-swf
TEST    acodec-adpcm-yamaha
TEST    acodec-adpcm-adx-trellis
TEST    acodec-adpcm-ima_qt-trellis
TEST    acodec-adpcm-ima_wav-trellis
TEST    acodec-adpcm-ms-trellis
TEST    acodec-adpcm-swf-trellis
TEST    acodec-adpcm-yamaha-trellis
TEST    acodec-mp2
TEST    acodec-mp2fixed
TEST    acodec-alac
TEST    acodec-dca
TEST    acodec-dca2
TEST    acodec-flac
TEST    acodec-flac-exact-rice
TEST    acodec-g723_1
TEST    acodec-ra144
TEST    acodec-wavpack
TEST    acodec-s302m
TEST    acodec-roqaudio
TEST    acodec-tta
GEN	tests/data/vsynth1.yuv
HOSTLD	tests/rotozoom
GEN	tests/data/vsynth3.yuv
LD	libavformat/tests/seek
LD	libavfilter/tests/filtfmts
GEN	tests/data/ffprobe-test.nut
TEST    probe-format-roundup997
TEST    probe-format-roundup1383
TEST    probe-format-roundup1414
TEST    probe-format-roundup2015
GEN	tests/data/vsynth_lena.yuv
TEST    ac3-2.0
TEST    ac3-4.0
TEST    ac3-4.0-downmix-mono
TEST    ac3-4.0-downmix-stereo
TEST    ac3-5.1
TEST    ac3-5.1-downmix-mono
TEST    ac3-5.1-downmix-stereo
TEST    ac3-fixed-2.0
TEST    ac3-fixed-4.0-downmix-mono
TEST    ac3-fixed-5.1-downmix-mono
TEST    ac3-fixed-5.1-downmix-stereo
TEST    ac3-encode
TEST    eac3-1
TEST    ac3-fixed-encode
TEST    eac3-2
TEST    eac3-3
TEST    eac3-4
TEST    eac3-5
TEST    eac3-encode
TEST    eac3-core-bsf
TEST    adpcm-4xm
TEST    adpcm-afc
TEST    adpcm-creative
TEST    adpcm-creative-8-2bit
TEST    adpcm-creative-8-2.6bit
TEST    adpcm-creative-8-4bit
TEST    adpcm-dtk
TEST    adpcm-ea-1
TEST    adpcm-ea-2
TEST    adpcm-ea-maxis-xa
TEST    adpcm-ea-r1
TEST    adpcm-ea-r3
TEST    adpcm-ea-r2
TEST    adpcm-ima-amv
TEST    adpcm-ima-apc
TEST    adpcm-ima-dk3
TEST    adpcm-ima-dk4
TEST    adpcm-ima-ea-eacs
TEST    adpcm-ima-ea-sead
TEST    adpcm-ima-iss
TEST    adpcm-ima-oki
TEST    adpcm-ima-rad
TEST    adpcm-ima-smjpeg
TEST    adpcm-ima_wav-stereo
TEST    adpcm-ima-ws
TEST    adpcm-ms-mono
TEST    adpcm_ms-stereo
TEST    adpcm-thp
TEST    adpcm-vima
TEST    adpcm-xa
TEST    adpcm-argo-mono
TEST    adpcm-ima-ssi-stereo
TEST    adpcm-ima-ssi-mono
TEST    adpcm-argo-stereo
TEST    adpcm-ima-apm-mono
TEST    adpcm-ima-apm-stereo
TEST    adpcm-ima-alp-mono
TEST    adpcm-ima-alp-stereo
TEST    adpcm-ima-cunning-single
TEST    adpcm-ima-cunning-track0
TEST    adpcm-ima-cunning-track1
TEST    adpcm-ima-cunning-trunc-t1
TEST    adpcm-ima-cunning-trunc-t2-track0
TEST    adpcm-ima-cunning-trunc-t2-track1
TEST    adpcm-ima-cunning-trunc-t2a-track0
TEST    adpcm-ima-cunning-trunc-t2a-track1
TEST    adpcm-ima-cunning-trunc-h2
TEST    atrac1-1
TEST    atrac1-2
TEST    atrac3-1
TEST    atrac3-3
TEST    atrac3-2
TEST    atrac3p-1
TEST    atrac3p-2
TEST    bmp-1bit
TEST    bmp-4bit-os2
TEST    bmp-4bit
TEST    bmp-8bit
TEST    bmp-8bit-os2
TEST    bmp-15bit
TEST    bmp-15bit-mask
TEST    bmp-16bit-mask
TEST    bmp-24bit
TEST    bmp-32bit
TEST    bmp-32bit-mask
TEST    bmp-rle8
TEST    bmp-rle4
TEST    cbs-av1-av1-1-b8-02-allintra
TEST    cbs-av1-av1-1-b8-03-sizedown
TEST    cbs-av1-av1-1-b8-03-sizeup
TEST    cbs-av1-av1-1-b8-04-cdfupdate
TEST    cbs-av1-av1-1-b8-05-mv
TEST    cbs-av1-av1-1-b8-06-mfmv
TEST    cbs-av1-av1-1-b8-22-svc-L1T2
TEST    cbs-av1-av1-1-b8-22-svc-L2T1
TEST    cbs-av1-av1-1-b8-22-svc-L2T2
TEST    cbs-av1-av1-1-b8-23-film_grain-50
TEST    cbs-av1-av1-1-b10-23-film_grain-50
TEST    cbs-av1-decode_model
TEST    cbs-av1-frames_refs_short_signaling
TEST    cbs-av1-non_uniform_tiling
TEST    cbs-av1-seq_hdr_op_param_info
TEST    cbs-av1-switch_frame
TEST    cbs-h264-SVA_Base_B
TEST    cbs-h264-FM1_BT_B
TEST    cbs-h264-BASQP1_Sony_C
TEST    cbs-h264-CVFC1_Sony_C
TEST    cbs-h264-AUD_MW_E
TEST    cbs-h264-CVBS3_Sony_C
TEST    cbs-h264-MR1_BT_A
TEST    cbs-h264-CVWP1_TOSHIBA_E
TEST    cbs-h264-CVNLFI1_Sony_C
TEST    cbs-h264-Sharp_MP_PAFF_1r2
TEST    cbs-h264-CVMANL1_TOSHIBA_B
TEST    cbs-h264-sp1_bt_a
TEST    cbs-h264-CVSE2_Sony_B
TEST    cbs-h264-CABACI3_Sony_B
TEST    cbs-h264-sei-1
TEST    cbs-hevc-STRUCT_A_Samsung_5
TEST    cbs-hevc-SLIST_A_Sony_4
TEST    cbs-hevc-WP_A_Toshiba_3
TEST    cbs-hevc-SLIST_D_Sony_9
TEST    cbs-hevc-CAINIT_E_SHARP_3
TEST    cbs-hevc-CAINIT_H_SHARP_3
TEST    cbs-hevc-TILES_B_Cisco_1
TEST    cbs-hevc-WPP_A_ericsson_MAIN_2
TEST    cbs-hevc-WPP_F_ericsson_MAIN_2
TEST    cbs-hevc-ipcm_E_NEC_2
TEST    cbs-hevc-NUT_A_ericsson_5
TEST    cbs-hevc-PICSIZE_A_Bossen_1
TEST    cbs-hevc-PICSIZE_B_Bossen_1
TEST    cbs-hevc-RPS_A_docomo_4
TEST    cbs-hevc-RPS_E_qualcomm_5
TEST    cbs-hevc-LTRPSPS_A_Qualcomm_1
TEST    cbs-hevc-RPLM_A_qualcomm_4
TEST    cbs-hevc-CONFWIN_A_Sony_1
TEST    cbs-hevc-HRD_A_Fujitsu_2
TEST    cbs-hevc-SLPPLP_A_VIDYO_2
TEST    cbs-mpeg2-hhi_burst_422_short
TEST    cbs-mpeg2-sony-ct3
TEST    cbs-mpeg2-tcela-6
TEST    cbs-vp9-vp90-2-03-deltaq
TEST    cbs-vp9-vp90-2-05-resize
TEST    cbs-vp9-vp90-2-06-bilinear
TEST    cbs-vp9-vp90-2-09-lf_deltas
TEST    cbs-vp9-vp90-2-10-show-existing-frame
TEST    cbs-vp9-vp90-2-10-show-existing-frame2
TEST    cbs-vp9-vp90-2-segmentation-aq-akiyo
TEST    cbs-vp9-vp90-2-segmentation-sf-akiyo
TEST    cbs-vp9-vp90-2-tiling-pedestrian
TEST    cbs-vp9-vp91-2-04-yuv440
TEST    cbs-vp9-vp91-2-04-yuv444
TEST    cbs-vp9-vp92-2-20-10bit-yuv420
TEST    cbs-vp9-vp93-2-20-10bit-yuv422
TEST    cbs-vp9-vp93-2-20-12bit-yuv444
TEST    cdxl-bitline-ham6
TEST    cdxl-ham6
TEST    cdxl-ham8
TEST    cdxl-pal8
TEST    cdxl-pal8-small
TEST    cover-art-ape
TEST    cover-art-flac
TEST    cover-art-m4a
TEST    cover-art-ogg
TEST    cover-art-wma
TEST    cover-art-wma-id3
TEST    cover-art-wma-metadatalib
TEST    cover-art-wv
TEST    dfa1
TEST    dfa2
TEST    dfa3
TEST    dfa4
TEST    dfa5
TEST    dfa6
TEST    dfa7
TEST    dfa8
TEST    dfa9
TEST    dfa11
TEST    dfa10
TEST    dpcm-idroq
TEST    dpcm-interplay
TEST    dpcm-sierra
TEST    dpcm-xan
TEST    filter-acrossfade
TEST    filter-silenceremove
TEST    filter-stereotools
TEST    filter-tremolo
GEN	tests/data/asynth-44100-2-2.wav
GEN	tests/data/asynth-44100-2-3.wav
TEST    filter-hdcd-mix
TEST    filter-aresample
TEST    filter-hdcd-mix-psoff
TEST    filter-hdcd-analyze-pe
TEST    filter-hdcd-analyze-lle
TEST    filter-hdcd-analyze-cdt
TEST    filter-hdcd-analyze-tgm
TEST    filter-hdcd-analyze-ltgm
TEST    filter-hdcd-analyze-pel
TEST    filter-hdcd-false-positive
TEST    filter-hdcd-detect-errors
libavcodec/libavcodec.a(webp.o): In function `convert_background_color':
/var/lib/jenkins/workspace/ffmpeg-patchwork/libavcodec/webp.c:1406: undefined reference to `sws_getContext'
/var/lib/jenkins/workspace/ffmpeg-patchwork/libavcodec/webp.c:1412: undefined reference to `sws_scale'
/var/lib/jenkins/workspace/ffmpeg-patchwork/libavcodec/webp.c:1419: undefined reference to `sws_freeContext'
/var/lib/jenkins/workspace/ffmpeg-patchwork/libavcodec/webp.c:1419: undefined reference to `sws_freeContext'
collect2: error: ld returned 1 exit status
TEST    filter-hdcd-20bit
ffbuild/library.mak:102: recipe for target 'libavcodec/tests/options' failed
make: *** [libavcodec/tests/options] Error 1
make: *** Waiting for unfinished jobs....
TEST    filter-hdcd-mono
libavcodec/libavcodec.a(webp.o): In function `convert_background_color':
/var/lib/jenkins/workspace/ffmpeg-patchwork/libavcodec/webp.c:1406: undefined reference to `sws_getContext'
/var/lib/jenkins/workspace/ffmpeg-patchwork/libavcodec/webp.c:1412: undefined reference to `sws_scale'
/var/lib/jenkins/workspace/ffmpeg-patchwork/libavcodec/webp.c:1419: undefined reference to `sws_freeContext'
/var/lib/jenkins/workspace/ffmpeg-patchwork/libavcodec/webp.c:1419: undefined reference to `sws_freeContext'
collect2: error: ld returned 1 exit status
ffbuild/library.mak:102: recipe for target 'libavcodec/tests/utils' failed
make: *** [libavcodec/tests/utils] Error 1
libavcodec/libavcodec.a(webp.o): In function `convert_background_color':
/var/lib/jenkins/workspace/ffmpeg-patchwork/libavcodec/webp.c:1406: undefined reference to `sws_getContext'
/var/lib/jenkins/workspace/ffmpeg-patchwork/libavcodec/webp.c:1412: undefined reference to `sws_scale'
/var/lib/jenkins/workspace/ffmpeg-patchwork/libavcodec/webp.c:1419: undefined reference to `sws_freeContext'
/var/lib/jenkins/workspace/ffmpeg-patchwork/libavcodec/webp.c:1419: undefined reference to `sws_freeContext'
collect2: error: ld returned 1 exit status
ffbuild/library.mak:102: recipe for target 'libavformat/tests/fifo_muxer' failed
make: *** [libavformat/tests/fifo_muxer] Error 1
libavcodec/libavcodec.a(webp.o): In function `convert_background_color':
/var/lib/jenkins/workspace/ffmpeg-patchwork/libavcodec/webp.c:1406: undefined reference to `sws_getContext'
/var/lib/jenkins/workspace/ffmpeg-patchwork/libavcodec/webp.c:1412: undefined reference to `sws_scale'
/var/lib/jenkins/workspace/ffmpeg-patchwork/libavcodec/webp.c:1419: undefined reference to `sws_freeContext'
/var/lib/jenkins/workspace/ffmpeg-patchwork/libavcodec/webp.c:1419: undefined reference to `sws_freeContext'
collect2: error: ld returned 1 exit status
ffbuild/library.mak:102: recipe for target 'libavformat/tests/url' failed
make: *** [libavformat/tests/url] Error 1
libavcodec/libavcodec.a(webp.o): In function `convert_background_color':
/var/lib/jenkins/workspace/ffmpeg-patchwork/libavcodec/webp.c:1406: undefined reference to `sws_getContext'
/var/lib/jenkins/workspace/ffmpeg-patchwork/libavcodec/webp.c:1412: undefined reference to `sws_scale'
/var/lib/jenkins/workspace/ffmpeg-patchwork/libavcodec/webp.c:1419: undefined reference to `sws_freeContext'
/var/lib/jenkins/workspace/ffmpeg-patchwork/libavcodec/webp.c:1419: undefined reference to `sws_freeContext'
collect2: error: ld returned 1 exit status
ffbuild/library.mak:102: recipe for target 'libavformat/tests/movenc' failed
make: *** [libavformat/tests/movenc] Error 1
libavcodec/libavcodec.a(webp.o): In function `convert_background_color':
/var/lib/jenkins/workspace/ffmpeg-patchwork/libavcodec/webp.c:1406: undefined reference to `sws_getContext'
/var/lib/jenkins/workspace/ffmpeg-patchwork/libavcodec/webp.c:1412: undefined reference to `sws_scale'
/var/lib/jenkins/workspace/ffmpeg-patchwork/libavcodec/webp.c:1419: undefined reference to `sws_freeContext'
/var/lib/jenkins/workspace/ffmpeg-patchwork/libavcodec/webp.c:1419: undefined reference to `sws_freeContext'
collect2: error: ld returned 1 exit status
ffbuild/library.mak:102: recipe for target 'libavformat/tests/noproxy' failed
make: *** [libavformat/tests/noproxy] Error 1
libavcodec/libavcodec.a(webp.o): In function `convert_background_color':
/var/lib/jenkins/workspace/ffmpeg-patchwork/libavcodec/webp.c:1406: undefined reference to `sws_getContext'
/var/lib/jenkins/workspace/ffmpeg-patchwork/libavcodec/webp.c:1412: undefined reference to `sws_scale'
/var/lib/jenkins/workspace/ffmpeg-patchwork/libavcodec/webp.c:1419: undefined reference to `sws_freeContext'
/var/lib/jenkins/workspace/ffmpeg-patchwork/libavcodec/webp.c:1419: undefined reference to `sws_freeContext'
collect2: error: ld returned 1 exit status
ffbuild/library.mak:102: recipe for target 'libavformat/tests/seek' failed
make: *** [libavformat/tests/seek] Error 1