TEST    vsynth3-asv1
TEST    vsynth3-asv2
TEST    vsynth3-cljr
TEST    vsynth3-dnxhd-720p-hr-lb
TEST    vsynth3-dnxhd-edge1-hr
TEST    vsynth3-dnxhd-edge2-hr
TEST    vsynth3-dnxhd-edge3-hr
TEST    vsynth3-dnxhd-4k-hr-lb
TEST    vsynth3-dnxhd-2k-hr-hq
TEST    vsynth3-dnxhd-uhd-hr-sq
TEST    vsynth3-dnxhd-1080i-10bit
TEST    vsynth3-dnxhd-1080i-colr
TEST    vsynth3-dnxhd-hr-lb-mov
TEST    vsynth3-dnxhd-hr-sq-mov
TEST    vsynth3-dnxhd-hr-hq-mov
TEST    vsynth3-dv-hd
TEST    vsynth3-dv-fhd
TEST    vsynth3-ffv1
TEST    vsynth3-ffv1-v0
TEST    vsynth3-ffv1-v3-yuv420p
TEST    vsynth3-ffv1-v3-yuv422p10
TEST    vsynth3-ffv1-v3-yuv444p16
TEST    vsynth3-ffv1-v3-bgr0
TEST    vsynth3-ffv1-v3-rgb48
TEST    vsynth3-ffvhuff
TEST    vsynth3-ffvhuff444
TEST    vsynth3-ffvhuff420p12
TEST    vsynth3-ffvhuff422p10left
TEST    vsynth3-ffvhuff444p16
TEST    vsynth3-flashsv
TEST    vsynth3-flashsv2
TEST    vsynth3-flv
TEST    vsynth3-huffyuv
TEST    vsynth3-huffyuvbgr24
TEST    vsynth3-huffyuvbgra
TEST    vsynth3-jpegls
TEST    vsynth3-jpeg2000
TEST    vsynth3-jpeg2000-97
TEST    vsynth3-ljpeg
TEST    vsynth3-mjpeg
TEST    vsynth3-mjpeg-422
TEST    vsynth3-mjpeg-444
TEST    vsynth3-mjpeg-trell
TEST    vsynth3-mjpeg-trell-huffman
TEST    vsynth3-mjpeg-huffman
TEST    vsynth3-mpeg1
TEST    vsynth3-mpeg1b
TEST    vsynth3-mpeg2
TEST    vsynth3-mpeg2-422
TEST    vsynth3-mpeg2-idct-int
TEST    vsynth3-mpeg2-ilace
TEST    vsynth3-mpeg2-ivlc-qprd
TEST    vsynth3-mpeg2-thread
TEST    vsynth3-mpeg2-thread-ivlc
TEST    vsynth3-mpeg4
TEST    vsynth3-mpeg4-rc
TEST    vsynth3-mpeg4-adv
TEST    vsynth3-mpeg4-qprd
TEST    vsynth3-mpeg4-adap
TEST    vsynth3-mpeg4-qpel
TEST    vsynth3-mpeg4-thread
TEST    vsynth3-mpeg4-error
TEST    vsynth3-mpeg4-nr
TEST    vsynth3-mpeg4-nsse
TEST    vsynth3-msmpeg4
TEST    vsynth3-msmpeg4v2
TEST    vsynth3-mpng
TEST    vsynth3-prores
TEST    vsynth3-prores_int
TEST    vsynth3-prores_444
TEST    vsynth3-prores_444_int
TEST    vsynth3-prores_ks
TEST    vsynth3-qtrle
TEST    vsynth3-rgb
TEST    vsynth3-bpp1
TEST    vsynth3-bpp15
TEST    vsynth3-mov-bgr24
TEST    vsynth3-mov-bpp15
TEST    vsynth3-mov-bpp16
TEST    vsynth3-svq1
TEST    vsynth3-r210
TEST    vsynth3-v210
TEST    vsynth3-v210-10
TEST    vsynth3-v308
TEST    vsynth3-v408
TEST    vsynth3-wmv1
TEST    vsynth3-wmv2
TEST    vsynth3-yuv
TEST    vsynth3-xface
TEST    vsynth3-yuv4
TEST    vsynth3-zlib
TEST    lavf-aiff
TEST    lavf-al
TEST    lavf-ast
TEST    lavf-au
TEST    lavf-caf
TEST    lavf-mmf
TEST    lavf-ogg
TEST    lavf-rso
TEST    lavf-sox
TEST    lavf-ul
TEST    lavf-voc
TEST    lavf-ircam
TEST    lavf-s16.voc
TEST    lavf-wav
TEST    lavf-peak.wav
TEST    lavf-peak_only.wav
TEST    lavf-w64
TEST    lavf-tta
TEST    lavf-mka
TEST    lavf-wv
TEST    lavf-asf
TEST    lavf-avi
TEST    lavf-dv
TEST    lavf-dv_pal
TEST    lavf-dv_ntsc
TEST    lavf-flm
TEST    lavf-gxf
TEST    lavf-gxf_pal
TEST    lavf-gxf_ntsc
TEST    lavf-mkv
TEST    lavf-mkv_attachment
TEST    lavf-mov
TEST    lavf-ismv
TEST    lavf-mov_rtphint
TEST    lavf-mp4
TEST    lavf-mpg
TEST    lavf-mxf_dv25
TEST    lavf-mxf_dvcpro50
TEST    lavf-mxf_opatom
TEST    lavf-mxf_opatom_audio
TEST    lavf-nut
TEST    lavf-rm
TEST    lavf-smjpeg
TEST    lavf-swf
TEST    lavf-wtv
TEST    lavf-bmp
TEST    lavf-dpx
TEST    lavf-gbrp10le.dpx
TEST    lavf-gbrp12le.dpx
TEST    lavf-rgb48le.dpx
TEST    lavf-rgb48le_10.dpx
TEST    lavf-rgba64le.dpx
TEST    lavf-jpg
TEST    lavf-pam
TEST    lavf-rgba.pam
TEST    lavf-gray.pam
TEST    lavf-gray16be.pam
TEST    lavf-rgb48be.pam
--- ./tests/ref/lavf/gbrp12le.dpx	2020-07-16 18:53:10.236541348 -0400
+++ tests/data/fate/lavf-gbrp12le.dpx	2020-10-07 17:07:11.908976612 -0400
@@ -1,3 +1,3 @@
-a4cfea1797c928f2eff73573e559675d *tests/data/images/gbrp12le.dpx/02.gbrp12le.dpx
+056a0852dcd8e4d8727114df4a247dd4 *tests/data/images/gbrp12le.dpx/02.gbrp12le.dpx
 tests/data/images/gbrp12le.dpx/%02d.gbrp12le.dpx CRC=0x1c755633
 609920 tests/data/images/gbrp12le.dpx/02.gbrp12le.dpx
Test lavf-gbrp12le.dpx failed. Look at tests/data/fate/lavf-gbrp12le.dpx.err for details.
tests/Makefile:255: recipe for target 'fate-lavf-gbrp12le.dpx' failed
make: *** [fate-lavf-gbrp12le.dpx] Error 1
make: *** Waiting for unfinished jobs....
--- ./tests/ref/lavf/gbrp10le.dpx	2020-07-16 18:53:10.236541348 -0400
+++ tests/data/fate/lavf-gbrp10le.dpx	2020-10-07 17:07:11.920976841 -0400
@@ -1,3 +1,3 @@
-7ca935d5d5e00c54acbc85565d3039b6 *tests/data/images/gbrp10le.dpx/02.gbrp10le.dpx
+69b9da05fa73a4495ea04ce5f45b51d6 *tests/data/images/gbrp10le.dpx/02.gbrp10le.dpx
 tests/data/images/gbrp10le.dpx/%02d.gbrp10le.dpx CRC=0xe6663fba
 407168 tests/data/images/gbrp10le.dpx/02.gbrp10le.dpx
Test lavf-gbrp10le.dpx failed. Look at tests/data/fate/lavf-gbrp10le.dpx.err for details.
tests/Makefile:255: recipe for target 'fate-lavf-gbrp10le.dpx' failed
make: *** [fate-lavf-gbrp10le.dpx] Error 1
--- ./tests/ref/lavf/rgb48le.dpx	2020-07-16 18:53:10.236541348 -0400
+++ tests/data/fate/lavf-rgb48le.dpx	2020-10-07 17:07:11.936977147 -0400
@@ -1,3 +1,3 @@
-075963c3c08978b6a20555ba09161434 *tests/data/images/rgb48le.dpx/02.rgb48le.dpx
+6e7d757279eaa914a92be107f8f01077 *tests/data/images/rgb48le.dpx/02.rgb48le.dpx
 tests/data/images/rgb48le.dpx/%02d.rgb48le.dpx CRC=0xe5b9c023
 609920 tests/data/images/rgb48le.dpx/02.rgb48le.dpx
Test lavf-rgb48le.dpx failed. Look at tests/data/fate/lavf-rgb48le.dpx.err for details.
tests/Makefile:255: recipe for target 'fate-lavf-rgb48le.dpx' failed
make: *** [fate-lavf-rgb48le.dpx] Error 1
--- ./tests/ref/lavf/rgb48le_10.dpx	2020-07-16 18:53:10.236541348 -0400
+++ tests/data/fate/lavf-rgb48le_10.dpx	2020-10-07 17:07:11.952977453 -0400
@@ -1,3 +1,3 @@
-b9f22728f8ff393bf30cf6cbd624fa95 *tests/data/images/rgb48le_10.dpx/02.rgb48le_10.dpx
+097c4ff8138d76bffa51c1e8c36ea90f *tests/data/images/rgb48le_10.dpx/02.rgb48le_10.dpx
 tests/data/images/rgb48le_10.dpx/%02d.rgb48le_10.dpx CRC=0xf38d5830
 407168 tests/data/images/rgb48le_10.dpx/02.rgb48le_10.dpx
Test lavf-rgb48le_10.dpx failed. Look at tests/data/fate/lavf-rgb48le_10.dpx.err for details.
tests/Makefile:255: recipe for target 'fate-lavf-rgb48le_10.dpx' failed
make: *** [fate-lavf-rgb48le_10.dpx] Error 1
--- ./tests/ref/lavf/rgba64le.dpx	2020-07-16 18:53:10.236541348 -0400
+++ tests/data/fate/lavf-rgba64le.dpx	2020-10-07 17:07:11.964977683 -0400
@@ -1,3 +1,3 @@
-545603630f30dec2768c8ae8d12eb8ea *tests/data/images/rgba64le.dpx/02.rgba64le.dpx
+51ccad3d05c1cef9db958adf01c9b55f *tests/data/images/rgba64le.dpx/02.rgba64le.dpx
 tests/data/images/rgba64le.dpx/%02d.rgba64le.dpx CRC=0xe72ce131
 812672 tests/data/images/rgba64le.dpx/02.rgba64le.dpx
Test lavf-rgba64le.dpx failed. Look at tests/data/fate/lavf-rgba64le.dpx.err for details.
tests/Makefile:255: recipe for target 'fate-lavf-rgba64le.dpx' failed
make: *** [fate-lavf-rgba64le.dpx] Error 1