libswscale/ppc/yuv2rgb_altivec.c: In function 'altivec_yuv2_abgr':
libswscale/ppc/yuv2rgb_altivec.c:338:18: error: implicit declaration of function 'vec_xl' [-Werror=implicit-function-declaration]
             y0 = vec_xl(0, y1i)                                              \
                  ^
libswscale/ppc/yuv2rgb_altivec.c:437:1: note: in expansion of macro 'DEFCSP420_CVT'
 DEFCSP420_CVT(yuv2_abgr,  out_abgr)
 ^
libswscale/ppc/yuv2rgb_altivec.c:338:16: error: incompatible types when assigning to type '__vector unsigned char' from type 'int'
             y0 = vec_xl(0, y1i)                                              \
                ^
libswscale/ppc/yuv2rgb_altivec.c:437:1: note: in expansion of macro 'DEFCSP420_CVT'
 DEFCSP420_CVT(yuv2_abgr,  out_abgr)
 ^
libswscale/ppc/yuv2rgb_altivec.c:340:16: error: incompatible types when assigning to type '__vector unsigned char' from type 'int'
             y1 = vec_xl(0, y2i)                                              \
                ^
libswscale/ppc/yuv2rgb_altivec.c:437:1: note: in expansion of macro 'DEFCSP420_CVT'
 DEFCSP420_CVT(yuv2_abgr,  out_abgr)
 ^
libswscale/ppc/yuv2rgb_altivec.c:437:1: error: can't convert between vector values of different size
libswscale/ppc/yuv2rgb_altivec.c:437:1: error: can't convert between vector values of different size
libswscale/ppc/yuv2rgb_altivec.c: In function 'altivec_yuv2_bgra':
libswscale/ppc/yuv2rgb_altivec.c:338:16: error: incompatible types when assigning to type '__vector unsigned char' from type 'int'
             y0 = vec_xl(0, y1i)                                              \
                ^
libswscale/ppc/yuv2rgb_altivec.c:438:1: note: in expansion of macro 'DEFCSP420_CVT'
 DEFCSP420_CVT(yuv2_bgra,  out_bgra)
 ^
libswscale/ppc/yuv2rgb_altivec.c:340:16: error: incompatible types when assigning to type '__vector unsigned char' from type 'int'
             y1 = vec_xl(0, y2i)                                              \
                ^
libswscale/ppc/yuv2rgb_altivec.c:438:1: note: in expansion of macro 'DEFCSP420_CVT'
 DEFCSP420_CVT(yuv2_bgra,  out_bgra)
 ^
libswscale/ppc/yuv2rgb_altivec.c:438:1: error: can't convert between vector values of different size
libswscale/ppc/yuv2rgb_altivec.c:438:1: error: can't convert between vector values of different size
libswscale/ppc/yuv2rgb_altivec.c: In function 'altivec_yuv2_rgba':
libswscale/ppc/yuv2rgb_altivec.c:338:16: error: incompatible types when assigning to type '__vector unsigned char' from type 'int'
             y0 = vec_xl(0, y1i)                                              \
                ^
libswscale/ppc/yuv2rgb_altivec.c:439:1: note: in expansion of macro 'DEFCSP420_CVT'
 DEFCSP420_CVT(yuv2_rgba,  out_rgba)
 ^
libswscale/ppc/yuv2rgb_altivec.c:340:16: error: incompatible types when assigning to type '__vector unsigned char' from type 'int'
             y1 = vec_xl(0, y2i)                                              \
                ^
libswscale/ppc/yuv2rgb_altivec.c:439:1: note: in expansion of macro 'DEFCSP420_CVT'
 DEFCSP420_CVT(yuv2_rgba,  out_rgba)
 ^
libswscale/ppc/yuv2rgb_altivec.c:439:1: error: can't convert between vector values of different size
libswscale/ppc/yuv2rgb_altivec.c:439:1: error: can't convert between vector values of different size
libswscale/ppc/yuv2rgb_altivec.c: In function 'altivec_yuv2_argb':
libswscale/ppc/yuv2rgb_altivec.c:338:16: error: incompatible types when assigning to type '__vector unsigned char' from type 'int'
             y0 = vec_xl(0, y1i)                                              \
                ^
libswscale/ppc/yuv2rgb_altivec.c:440:1: note: in expansion of macro 'DEFCSP420_CVT'
 DEFCSP420_CVT(yuv2_argb,  out_argb)
 ^
libswscale/ppc/yuv2rgb_altivec.c:340:16: error: incompatible types when assigning to type '__vector unsigned char' from type 'int'
             y1 = vec_xl(0, y2i)                                              \
                ^
libswscale/ppc/yuv2rgb_altivec.c:440:1: note: in expansion of macro 'DEFCSP420_CVT'
 DEFCSP420_CVT(yuv2_argb,  out_argb)
 ^
libswscale/ppc/yuv2rgb_altivec.c:440:1: error: can't convert between vector values of different size
libswscale/ppc/yuv2rgb_altivec.c:440:1: error: can't convert between vector values of different size
libswscale/ppc/yuv2rgb_altivec.c: In function 'altivec_yuv2_rgb24':
libswscale/ppc/yuv2rgb_altivec.c:338:16: error: incompatible types when assigning to type '__vector unsigned char' from type 'int'
             y0 = vec_xl(0, y1i)                                              \
                ^
libswscale/ppc/yuv2rgb_altivec.c:441:1: note: in expansion of macro 'DEFCSP420_CVT'
 DEFCSP420_CVT(yuv2_rgb24, out_rgb24)
 ^
libswscale/ppc/yuv2rgb_altivec.c:340:16: error: incompatible types when assigning to type '__vector unsigned char' from type 'int'
             y1 = vec_xl(0, y2i)                                              \
                ^
libswscale/ppc/yuv2rgb_altivec.c:441:1: note: in expansion of macro 'DEFCSP420_CVT'
 DEFCSP420_CVT(yuv2_rgb24, out_rgb24)
 ^
libswscale/ppc/yuv2rgb_altivec.c:441:1: error: can't convert between vector values of different size
libswscale/ppc/yuv2rgb_altivec.c:441:1: error: can't convert between vector values of different size
libswscale/ppc/yuv2rgb_altivec.c: In function 'altivec_yuv2_bgr24':
libswscale/ppc/yuv2rgb_altivec.c:338:16: error: incompatible types when assigning to type '__vector unsigned char' from type 'int'
             y0 = vec_xl(0, y1i)                                              \
                ^
libswscale/ppc/yuv2rgb_altivec.c:442:1: note: in expansion of macro 'DEFCSP420_CVT'
 DEFCSP420_CVT(yuv2_bgr24, out_bgr24)
 ^
libswscale/ppc/yuv2rgb_altivec.c:340:16: error: incompatible types when assigning to type '__vector unsigned char' from type 'int'
             y1 = vec_xl(0, y2i)                                              \
                ^
libswscale/ppc/yuv2rgb_altivec.c:442:1: note: in expansion of macro 'DEFCSP420_CVT'
 DEFCSP420_CVT(yuv2_bgr24, out_bgr24)
 ^
libswscale/ppc/yuv2rgb_altivec.c:442:1: error: can't convert between vector values of different size
libswscale/ppc/yuv2rgb_altivec.c:442:1: error: can't convert between vector values of different size
libavcodec/utils.c: In function 'avcodec_flush_buffers':
libavcodec/utils.c:1110:5: warning: 'refcounted_frames' is deprecated [-Wdeprecated-declarations]
     if (!avctx->refcounted_frames)
     ^
In file included from libavcodec/utils.c:45:0:
libavcodec/avcodec.h:1357:9: note: declared here
     int refcounted_frames
         ^
cc1: some warnings being treated as errors
ffbuild/common.mak:67: recipe for target 'libswscale/ppc/yuv2rgb_altivec.o' failed
make: *** [libswscale/ppc/yuv2rgb_altivec.o] Error 1
make: *** Waiting for unfinished jobs....
fftools/cmdutils.c: In function 'print_all_libs_info':
fftools/cmdutils.c:1139:5: warning: 'avresample_version' is deprecated [-Wdeprecated-declarations]
     PRINT_LIB_INFO(avresample, AVRESAMPLE, flags, level)
     ^
In file included from fftools/cmdutils.c:37:0:
./libavresample/avresample.h:148:10: note: declared here
 unsigned avresample_version(void)
          ^
fftools/cmdutils.c:1139:5: warning: 'avresample_configuration' is deprecated [-Wdeprecated-declarations]
     PRINT_LIB_INFO(avresample, AVRESAMPLE, flags, level)
     ^
In file included from fftools/cmdutils.c:37:0:
./libavresample/avresample.h:158:13: note: declared here
 const char *avresample_configuration(void)
             ^
fftools/ffprobe.c: In function 'show_packet':
fftools/ffprobe.c:2071:5: warning: 'convergence_duration' is deprecated [-Wdeprecated-declarations]
     print_duration_ts(convergence_duration, pkt->convergence_duration)
     ^
In file included from ./libavcodec/bsf.h:30:0,
                 from ./libavcodec/avcodec.h:44,
                 from ./libavformat/avformat.h:312,
                 from fftools/ffprobe.c:31:
./libavcodec/packet.h:392:13: note: declared here
     int64_t convergence_duration
             ^
fftools/ffprobe.c:2072:5: warning: 'convergence_duration' is deprecated [-Wdeprecated-declarations]
     print_duration_time(convergence_duration_time, pkt->convergence_duration, &st->time_base)
     ^
In file included from ./libavcodec/bsf.h:30:0,
                 from ./libavcodec/avcodec.h:44,
                 from ./libavformat/avformat.h:312,
                 from fftools/ffprobe.c:31:
./libavcodec/packet.h:392:13: note: declared here
     int64_t convergence_duration
             ^
fftools/ffprobe.c: In function 'show_stream':
fftools/ffprobe.c:2591:9: warning: 'timecode_frame_start' is deprecated [-Wdeprecated-declarations]
         if (dec_ctx && dec_ctx->timecode_frame_start >= 0) {
         ^
In file included from ./libavformat/avformat.h:312:0,
                 from fftools/ffprobe.c:31:
./libavcodec/avcodec.h:1488:13: note: declared here
     int64_t timecode_frame_start
             ^
fftools/ffprobe.c:2593:13: warning: 'timecode_frame_start' is deprecated [-Wdeprecated-declarations]
             av_timecode_make_mpeg_tc_string(tcbuf, dec_ctx->timecode_frame_start)
             ^
In file included from ./libavformat/avformat.h:312:0,
                 from fftools/ffprobe.c:31:
./libavcodec/avcodec.h:1488:13: note: declared here
     int64_t timecode_frame_start
             ^
fftools/ffprobe.c:2657:5: warning: 'codec' is deprecated [-Wdeprecated-declarations]
     if (stream->codec->rc_max_rate > 0) print_val (max_bit_rate, stream->codec->rc_max_rate, unit_bit_per_second_str)
     ^
In file included from fftools/ffprobe.c:31:0:
./libavformat/avformat.h:884:21: note: declared here
     AVCodecContext *codec
                     ^
fftools/ffprobe.c:1828:12: warning: 'codec' is deprecated [-Wdeprecated-declarations]
     struct unit_value uv                                           \
            ^
fftools/ffprobe.c:2657:41: note: in expansion of macro 'print_val'
     if (stream->codec->rc_max_rate > 0) print_val (max_bit_rate, stream->codec->rc_max_rate, unit_bit_per_second_str)
                                         ^
In file included from fftools/ffprobe.c:31:0:
./libavformat/avformat.h:884:21: note: declared here
     AVCodecContext *codec
                     ^
fftools/ffprobe.c: In function 'open_input_file':
fftools/ffprobe.c:2953:13: warning: 'codec' is deprecated [-Wdeprecated-declarations]
             ist->dec_ctx->properties = stream->codec->properties
             ^
In file included from fftools/ffprobe.c:31:0:
./libavformat/avformat.h:884:21: note: declared here
     AVCodecContext *codec
                     ^
fftools/ffprobe.c:2954:13: warning: 'codec' is deprecated [-Wdeprecated-declarations]
             ist->dec_ctx->coded_width = stream->codec->coded_width
             ^
In file included from fftools/ffprobe.c:31:0:
./libavformat/avformat.h:884:21: note: declared here
     AVCodecContext *codec
                     ^
fftools/ffprobe.c:2955:13: warning: 'codec' is deprecated [-Wdeprecated-declarations]
             ist->dec_ctx->coded_height = stream->codec->coded_height
             ^
In file included from fftools/ffprobe.c:31:0:
./libavformat/avformat.h:884:21: note: declared here
     AVCodecContext *codec
                     ^