make: *** [tests/Makefile:312: fate-cavs] Error 69
make: *** [tests/Makefile:313: fate-ffmpeg-filter_colorkey] Error 69
make: *** [tests/Makefile:313: fate-cavs-demux] Error 1
cpu_flags(raw) = 0x00000003
cpu_flags_str(raw) = lsx lasx
cpu_flags(effective) = 0x00000003
cpu_flags_str(effective) = lsx lasx
threads = 1 (cpu_count = 32)
make: *** [tests/Makefile:313: fate-source] Error 1
make: Target 'fate' not remade because of errors.